{"text_format":"3","workbook":"xlsx","n_sheets":6,"sheets":["Serviceability Calculator","Helpful Hints","Checkboxes","Calculations","Sheet1","Lists"],"not_rendered":{"images":7,"macros":1,"defined_names":3},"read":"whole","date_system":"1900"}

{"sheet":"Serviceability Calculator","index":0,"n_rows":194,"n_cols":27,"rows_kept":194,"merged":[[1,2,1,26],[4,4,4,22],[5,4,5,6],[5,8,5,10],[5,12,5,14],[5,16,5,20],[6,4,6,6],[6,8,6,10],[6,12,6,14],[6,16,6,20],[7,4,7,6],[7,8,7,10],[7,12,7,14],[7,16,7,22],[8,8,8,10],[8,12,8,14],[8,16,8,20],[9,4,9,6],[9,8,9,10],[9,12,9,14],[9,16,9,22],[10,8,10,10],[10,12,10,14],[10,16,10,20],[11,4,11,6],[11,8,11,10],[11,12,11,14],[11,16,11,22],[12,8,12,10],[12,12,12,14],[12,16,12,20],[13,4,13,6],[13,8,13,10],[13,12,13,14],[13,16,13,22],[16,2,16,4],[18,4,18,6],[18,8,18,10],[18,12,18,14],[20,4,20,6],[20,8,20,10],[20,12,20,14],[20,16,20,22],[22,4,22,6],[22,8,22,10],[22,12,22,14],[22,16,22,22],[24,4,24,6],[24,8,24,10],[24,12,24,14],[24,16,24,22],[25,2,25,14],[26,4,26,6],[26,8,26,10],[26,12,26,14],[26,16,26,22],[28,4,28,6],[28,8,28,10],[28,12,28,14],[28,16,28,22],[30,4,30,6],[30,8,30,10],[30,12,30,14],[30,16,30,22],[30,23,30,24],[32,4,32,6],[32,8,32,10],[32,12,32,14],[32,16,32,22],[34,4,34,6],[34,8,34,10],[34,12,34,14],[34,16,34,22],[36,4,36,6],[36,8,36,10],[36,12,36,14],[36,16,36,22],[38,4,38,6],[38,8,38,10],[38,12,38,14],[38,16,38,22],[40,4,40,6],[40,8,40,10],[40,12,40,14],[40,16,40,22],[42,4,42,6],[42,8,42,10],[42,12,42,14],[42,16,42,22],[44,4,44,6],[44,8,44,10],[44,12,44,14],[44,16,44,22],[46,4,46,6],[46,8,46,10],[46,12,46,14],[46,16,46,22],[48,4,48,6],[48,8,48,10],[48,12,48,14],[48,16,48,22],[50,4,50,5],[50,8,50,9],[50,12,50,13],[50,16,50,18],[52,4,52,6],[52,8,52,10],[52,12,52,14],[52,16,52,22],[54,4,54,6],[54,8,54,10],[54,12,54,14],[54,16,54,22],[56,4,56,6],[56,8,56,10],[56,12,56,14],[56,16,56,22],[59,4,59,6],[59,8,59,10],[59,12,59,14],[59,16,59,20],[61,4,61,6],[61,8,61,10],[61,12,61,14],[61,16,61,22],[63,4,63,6],[63,8,63,10],[63,12,63,14],[63,16,63,22],[65,4,65,6],[65,8,65,10],[65,12,65,14],[65,16,65,22],[67,2,67,4],[67,8,67,18],[67,20,67,22],[69,4,69,6],[69,9,69,11],[69,13,69,14],[69,16,69,22],[69,24,69,26],[71,4,71,8],[71,24,71,26],[73,4,73,8],[73,24,73,26],[75,4,75,8],[75,24,75,26],[77,4,77,8],[77,24,77,26],[79,4,79,8],[79,24,79,26],[81,4,81,8],[81,24,81,26],[83,4,83,8],[83,24,83,26],[85,4,85,8],[85,24,85,26],[87,4,87,8],[87,24,87,26],[89,4,89,8],[89,24,89,26],[91,4,91,6],[91,8,91,10],[91,12,91,14],[91,15,91,23],[91,24,91,26],[93,2,93,4],[93,8,93,18],[93,20,93,22],[97,4,97,6],[97,8,97,10],[97,12,97,13],[97,16,97,18],[97,20,97,22],[97,24,97,26],[99,4,99,6],[99,8,99,10],[99,16,99,18],[99,20,99,22],[99,24,99,26],[101,4,101,6],[101,8,101,10],[101,16,101,18],[101,20,101,22],[101,24,101,26],[103,4,103,6],[103,8,103,10],[103,16,103,18],[103,20,103,22],[103,24,103,26],[105,4,105,6],[105,8,105,10],[105,16,105,18],[105,20,105,22],[105,24,105,26],[107,4,107,6],[107,8,107,10],[107,16,107,18],[107,20,107,22],[107,24,107,26],[109,4,109,6],[109,8,109,10],[109,16,109,18],[109,20,109,22],[109,24,109,26],[111,4,111,6],[111,24,111,26],[113,2,113,4],[113,8,113,18],[113,20,113,22],[117,4,117,6],[117,8,117,10],[117,11,117,13],[117,15,117,16],[117,18,117,19],[117,20,117,22],[117,24,117,26],[119,4,119,6],[119,8,119,10],[119,20,119,22],[119,24,119,26],[121,4,121,6],[121,8,121,10],[121,20,121,22],[121,24,121,26],[123,4,123,6],[123,8,123,10],[123,20,123,22],[123,24,123,26],[125,4,125,6],[125,8,125,10],[125,20,125,22],[125,24,125,26],[127,4,127,6],[127,8,127,10],[127,20,127,22],[127,24,127,26],[129,4,129,6],[129,8,129,10],[129,20,129,22],[129,24,129,26],[131,4,131,6],[131,8,131,10],[131,20,131,22],[131,24,131,26],[133,4,133,6],[133,8,133,10],[133,20,133,22],[133,24,133,26],[135,4,135,6],[135,8,135,10],[135,20,135,22],[135,24,135,26],[137,4,137,6],[137,8,137,10],[137,20,137,22],[137,24,137,26],[139,4,139,6],[139,8,139,10],[139,24,139,26],[141,4,141,6],[141,8,141,10],[141,24,141,26],[143,4,143,6],[143,8,143,10],[143,24,143,26],[145,4,145,6],[145,8,145,10],[145,24,145,26],[147,4,147,6],[147,8,147,14],[147,24,147,26],[149,4,149,6],[149,8,149,14],[149,24,149,26],[151,4,151,6],[151,8,151,14],[151,24,151,26],[153,24,153,26],[155,2,155,4],[155,24,155,26],[159,4,159,6],[159,8,162,12],[159,24,159,26],[162,4,162,6],[162,24,162,26],[163,2,163,8],[163,12,163,26],[165,4,165,6],[165,24,165,26],[167,4,167,6],[167,24,167,26],[169,2,169,22],[169,24,169,26],[171,2,171,4],[171,24,171,26],[173,4,173,6],[173,14,173,20],[173,24,173,26],[175,4,175,6],[175,14,175,20],[175,24,175,26],[177,4,177,6],[177,14,177,20],[177,24,177,26],[180,4,180,6],[180,8,180,26],[182,2,182,4],[182,24,182,26],[184,4,184,6],[184,8,184,26],[186,4,186,6],[186,8,186,26],[188,4,188,6],[188,8,188,26],[191,2,192,26],[193,2,194,26]]}
[]
[null,null,"\nResidential Loan Serviceability Calculator"]
[null,null,"Details of Applicants",{"$nulls":23},"Citi_v3.8"]
[]
[null,null,"Applicant/s Surname Only"]
[]
[{"$nulls":4},"Applicant 1",{"$nulls":3},"Applicant 2",{"$nulls":3},"Applicant 3",{"$nulls":3},"Applicant 4"]
[null,null,"Status (Couple or Single)"]
[]
[null,null,"Couple with Applicant?"]
[]
[null,null,"Household"]
[]
[null,null,"Number of Dependants"]
[null,null,"Only include common dependants"]
[]
[null,null,"Gross Annual Income"]
[]
[{"$nulls":4},"Applicant 1",{"$nulls":3},"Applicant 2",{"$nulls":3},"Applicant 3",{"$nulls":3},"Applicant 4"]
[]
[null,null,"Applicant Type"]
[]
[null,null,"Base Income (PAYG)"]
[]
[null,null,"Non-Base or Casual Income"]
[null,null,"For Non-Base non-regular income (where no payments have been received after 30th June 2020) you should multiply the non base income by 0.625 and then enter this figure in the above field."]
[null,null,"Foreign Income Gross"]
[]
[null,null,"Foreign Income Net"]
[]
[null,null,"Sole Trader/Partnership/Director"]
[]
[null,null,"Self Employed Income"]
[null,null,"Profit before tax"]
[null,null,"Depreciation Addback"]
[]
[null,null,"Superannuation Addback"]
[]
[null,null,"Interest Addback"]
[]
{"$rows_left_out":155}
{"sheet":"Helpful Hints","index":1,"n_rows":50,"n_cols":2,"rows_kept":50,"merged":[[0,0,0,1]]}
["Helpful hints for the Citibank Loan Serviceability Calculator"]
["Details of Applicants"]
["Applicant/s Full Name","Indicate the Surname only of all applicants.\nIf application is in a company name, include the surnames of the Directors."]
["Status (Couple or Single)","The status of each applicant: Single or Couple with other applicant in the same application.\nFor Company Applicants, the field is not mandatory."]
["Couple with Applicant?","If Status is \"Couple\", indicate the applicant which forms a couple with the current applicant.\nStatus of all applicants must be defined first.\nFor Company Applicants, the field is not mandatory."]
["Household","The household that the applicant belongs to. Maximum number or Households is 2.\nFor \"Couple\" scenario, select the same household across the applicants.\nFor Company Applicants, the it is mandatory to assign to a household which must be the same as the director’s."]
["Number of Dependants","The Number of Dependants in the Household. \nFor \"Couple\" scenario, include the common dependants for each applicant.\nFor Company Applicants, do not enter dependants."]
["Gross Annual Income"]
["Applicant type","Person Applicant or Company Applicant."]
["PAYG Income (Base Income, Non Base Income) ($)","Any gross PAYG income earned by the applicant.\nNon Base income can include: bonuses, commissions or overtime.  Refer to www.mortgagebroker.citibank.com.au for details on determining assessable non base income."]
["Foreign Gross Income ($)\n(currently unavailable)","Foreign Income converted into Australian Dollars."]
["Foreign Net Income ($)\n(currently unavailable)","The Total Net foreign Income converted into Australian Dollars."]
["Self Employed Income ($)","Profit or loss as provided in the business financial statements. Citi will take the lower of;\n1. most recent complete financial year or \n2. 120% of the prior financial year\nIf sales have reduced by more than 10% since the last complete financial year please contact your BDM or Brokerassist."]
["Self Employed Addbacks (Depreciation, Superannuation, Interest) ($)","Depreciation of business assets can be considered.  Please refer to your BDM or Brokerassist."]
["Company Income ($)","Profit or loss as provided in the business financial statements.  Refer to Self Employed Income."]
["Company Addbacks  (Depreciation, Superannuation, Interest, Other) ($)","Depreciation of business assets can be considered.  Please refer to your BDM or Brokerassist."]
["Applicant Share % on Company","For Director's use only, the share percentage held in the company.\nUsed to calculate the eligible income for NSI (e.g. Share % * Company Income/Company Addbacks)."]
["Other Non-Taxable Income ($)","E.g. tax free car allowance, not-for-profit tax free employment income."]
["Property Details"]
["Property Address","Address of each property."]
["Investment","Tick the checkbox if the property is used for investment purposes."]
["Rent Amount ($) and Frequency","Only applicable for Investment properties.\nRental income and frequency (e.g. weekly, fortnightly or annually) from the property.  For rental income from serviced apartments and commercial properties please enter 85% of the gross rental income."]
["Applicant Ownership Proportions","Indicate the ownership % of each applicant of the property. Total ownership % per property must be 100%.\nUsed to calculate the rent received by the applicant for every property (e.g. Rent for Applicant 1 is 20% *Total Rent Amount)."]
["Newly Requested Citi Loan Structure"]
["Loan Amount ($)","The limit of the new loan."]
["Tax Deductible Amount Outstanding ($)","Include only the tax deductible outstanding amount of the loan.\nOnly applicable to current residential Investment Loans or investment property purchases."]
["Term - Months","E.g. Enter 360 for a 30 year loan, 300 for a 25 year loan"]
["Interest Only Loan","Tick the checkbox if loan has an Interest Only period.\nInterest Only default term is 60 months."]
["Interest Rate","Interest rate applicable to the loan in percent"]
["Security Property","The property that is securing the loan. \nSelect from the list of properties defined under \"Property Details\" section."]
["All Other Liabilities"]
["Existing Loan - Loan Limit ($)","The current limit of the loan"]
["Existing Loan - Tax Deductible Amount Outstanding ($)","Include only the tax deductible outstanding amount of the loan.\nOnly applicable to current residential Investment Loans or investment property purchases."]
["Existing Loan - Remaining P&I Term","The remaining loan term in moths (e.g. enter 300 if the remaining loan term is 25 years)."]
["Existing Loan - Interest Rate","Interest rate applicable to the loan in percent."]
["Existing Loan - Citi Loan","Whether the loan is an existing Citibank loan."]
["Existing Loan - Security Property","The property that is securing the loan. \nSelect from the list of properties defined under \"Property Details\" section."]
["Personal Loan/Hide Purchase/Lease/Car Loan/Other Loan Repayments ($)","Monthly repayments on all other loans not being refinanced (Citibank or other)."]
["Total credit card limits ($)","Total credit card limits for all applicants."]
["Rent/Board Commitments ($)","Monthly rent or board expenses. \nA minimum value required per adult when living with family rent free."]
{"$rows_left_out":11}
{"sheet":"Checkboxes","index":2,"n_rows":36,"n_cols":3,"rows_kept":36,"hidden":true}
[]
["Property Details"]
[null,"Investment","N/A"]
["Property 1",false]
["Property 2",false]
["Property 3",false]
["Property 4",false]
["Property 5",false]
["Property 6",false]
["Property 7",false]
["Property 8",false]
["Property 9",false]
["Property 10",false]
[]
["Newly Requested Citi Loan Structure"]
[null,"IO Term"]
["Account 1",false]
["Account 2",false]
["Account 3",false]
["Account 4",false]
["Account 5",false]
["Account 6",false]
[]
[]
["All Other Liabilities - Loan"]
[null,"Citi Loan","IO Loan"]
["Existing Loan 1",false,false]
["Existing Loan 2",false,false]
["Existing Loan 3",false,false]
["Existing Loan 4",false,false]
["Existing Loan 5",false,false]
["Existing Loan 6",false,false]
["Existing Loan 7",false,false]
["Existing Loan 8",false,false]
["Existing Loan 9",false,false]
["Existing Loan 10",false,false]

{"sheet":"Calculations","index":3,"n_rows":239,"n_cols":54,"rows_kept":239,"hidden":true,"merged":[[92,1,92,8],[92,9,92,16],[92,17,92,24],[92,25,92,32]]}
[]
["Person Applicant Income"]
[]
["Tax rates"]
["Taxable Brackets","Min Interval","Max Interval","Difference","Rate"]
["$0 – $18,200",0,{"v":18200,"d":"$18,200.00"},{"$f":"C6-B6","v":{"v":18200,"d":"$18,200.00"}},{"v":0,"d":"0%"}]
["$18,201 – $37000",{"v":18200,"d":"$18,200.00"},{"v":45000,"d":"$45,000.00"},{"$f":"C7-B7","v":{"v":26800,"d":"$26,800.00"}},{"v":0.19,"d":"19%"}]
["$37,001 - $90,000",{"v":45000,"d":"$45,000.00"},{"v":120000,"d":"$120,000.00"},{"v":75000,"d":"$75,000.00"},{"v":0.325,"d":"32.5%"}]
["$90,001 – $180,000",{"v":120000,"d":"$120,000.00"},{"v":180000,"d":"$180,000.00"},{"v":60000,"d":"$60,000.00"},{"v":0.37,"d":"37%"}]
["Over $180,000",{"v":180000,"d":"$180,000.00"},{"v":100000000,"d":"$100,000,000.00"},{"v":99820000,"d":"$99,820,000.00"},{"v":0.45,"d":"45%"}]
[]
["Proxy for Medicare Levy - Singles","Min Interval","Max Interval","Rate"]
["$0-$90,000",0,{"v":90000,"d":"$90,000.00"},{"v":0.02,"d":"2.00%"}]
["$90,001-$105,000",{"v":90000,"d":"$90,000.00"},{"v":105000,"d":"$105,000.00"},{"v":0.03,"d":"3.00%"}]
["$105,001-$140,000",{"v":105000,"d":"$105,000.00"},{"v":140000,"d":"$140,000.00"},{"v":0.0325,"d":"3.25%"}]
[">=$140, 001",{"v":140000,"d":"$140,000.00"},{"v":100000000,"d":"$100,000,000.00"},{"v":0.035,"d":"3.50%"}]
[]
["Proxy for Medicare Levy - Family","Min Interval","Max Interval","Rate"]
["$0-$180,000",0,{"v":180000,"d":"$180,000.00"},{"v":0.02,"d":"2.00%"}]
["$180,001-$210,000",{"v":180000,"d":"$180,000.00"},{"v":210000,"d":"$210,000.00"},{"v":0.03,"d":"3.00%"}]
["$210,001-$280,000",{"v":210000,"d":"$210,000.00"},{"v":280000,"d":"$280,000.00"},{"v":0.0325,"d":"3.25%"}]
[">=$280,001",{"v":280000,"d":"$280,000.00"},{"v":100000000,"d":"$100,000,000.00"},{"v":0.035,"d":"3.5%"}]
[]
["Income Type","Serviceability %","Taxable"]
["Base Income (PAYG)",{"v":1,"d":"100%"},"Yes"]
["Non-Base or Casual Income",{"v":0.8,"d":"80%"},"Yes"]
["Foreign Income Gross",{"v":1,"d":"100%"},"No"]
["Foreign Income Net",{"v":1,"d":"100%"},"No"]
["Self Employed Income",{"v":1,"d":"100%"},"Yes"]
["Self Employed Depreciation Addback",{"v":1,"d":"100%"},"Yes"]
["Self Employed Superannuation Addback",{"v":1,"d":"100%"},"Yes"]
["Self Employed Interest Addback",{"v":1,"d":"100%"},"Yes"]
["Non-Taxable Income",{"v":1,"d":"100%"},"No"]
["Director Company Income",{"v":1,"d":"100%"},"Yes"]
["Director - Depreciation Addback",{"v":1,"d":"100%"},"Yes"]
["Director - Super Addback",{"v":1,"d":"100%"},"Yes"]
["Director - Interest Addback",{"v":1,"d":"100%"},"Yes"]
["Director - Other Addback",{"v":1,"d":"100%"},"Yes"]
[]
["Household Applicants/Dependants"]
{"$rows_left_out":200}
{"sheet":"Sheet1","index":4,"n_rows":0,"n_cols":0,"rows_kept":0,"hidden":true}

{"sheet":"Lists","index":5,"n_rows":12,"n_cols":21,"rows_kept":12,"hidden":true}
["Status","Couple Applicant 1","Couple Applicant 2","Couple Applicant 3","Couple Applicant 4","Dependants","Household","Applicant Type","Property State","Property/Liability Number","Yes/No","Loan repayment","Rent Frequency","SE Applicant 1","SE Applicant 2","SE Applicant 3","SE Applicant 4","Security","Sole Trader","IO","Loan Number"]
["Single","N/A","N/A","N/A","N/A",0,"Household 1","Person Applicant","WA",1,"Yes","P&I","Weekly",false,false,false,false,"Property 1","Sole Trader",60,1]
["Couple",{"$f":"IF(AND('Serviceability Calculator'!E8=\"Couple\",'Serviceability Calculator'!I8=\"Couple\"),\"Applicant 2\",\"\")","v":""},{"$f":"IF(AND('Serviceability Calculator'!I8=\"Couple\",'Serviceability Calculator'!E8=\"Couple\"),\"Applicant 1\",\"\")","v":""},{"$f":"IF(AND('Serviceability Calculator'!M8=\"Couple\",'Serviceability Calculator'!E8=\"Couple\"),\"Applicant 1\",\"\")","v":""},{"$f":"IF(AND('Serviceability Calculator'!Q8=\"Couple\",'Serviceability Calculator'!E8=\"Couple\"),\"Applicant 1\",\"\")","v":""},1,"Household 2","Company Applicant","Other State",2,"No","IO","Monthly",{"$nulls":4},"Property 2","Partnership",null,2]
[null,{"$f":"IF(AND('Serviceability Calculator'!E8=\"Couple\",'Serviceability Calculator'!M8=\"Couple\"),\"Applicant 3\",\"\")","v":""},{"$f":"IF(AND('Serviceability Calculator'!I8=\"Couple\",'Serviceability Calculator'!M8=\"Couple\"),\"Applicant 3\",\"\")","v":""},{"$f":"IF(AND('Serviceability Calculator'!M8=\"Couple\",'Serviceability Calculator'!I8=\"Couple\"),\"Applicant 2\",\"\")","v":""},{"$f":"IF(AND('Serviceability Calculator'!Q8=\"Couple\",'Serviceability Calculator'!I8=\"Couple\"),\"Applicant 2\",\"\")","v":""},2,{"$nulls":3},3,null,null,"Yearly",{"$nulls":4},"Property 3","Director",null,3]
[null,{"$f":"IF(AND('Serviceability Calculator'!E8=\"Couple\",'Serviceability Calculator'!Q8=\"Couple\"),\"Applicant 4\",\"\")","v":""},{"$f":"IF(AND('Serviceability Calculator'!I8=\"Couple\",'Serviceability Calculator'!Q8=\"Couple\"),\"Applicant 4\",\"\")","v":""},{"$f":"IF(AND('Serviceability Calculator'!M8=\"Couple\",'Serviceability Calculator'!Q8=\"Couple\"),\"Applicant 4\",\"\")","v":""},{"$f":"IF(AND('Serviceability Calculator'!Q8=\"Couple\",'Serviceability Calculator'!M8=\"Couple\"),\"Applicant 3\",\"\")","v":""},3,{"$nulls":3},4,{"$nulls":7},"Property 4","Combination",null,4]
[{"$nulls":5},4,{"$nulls":3},5,{"$nulls":7},"Property 5","None",null,5]
[{"$nulls":5},5,{"$nulls":3},6,{"$nulls":7},"Property 6",null,null,6]
[{"$nulls":5},6,{"$nulls":3},7,{"$nulls":7},"Property 7"]
[{"$nulls":5},7,{"$nulls":3},8,{"$nulls":7},"Property 8"]
[{"$nulls":5},8,{"$nulls":3},9,{"$nulls":7},"Property 9"]
[{"$nulls":5},9,{"$nulls":3},10,{"$nulls":7},"Property 10"]
[{"$nulls":5},10]